Target
Insulin receptor
Ligand
BDBM50334086
Substrate
Meas. Tech.
ChEMBL_701401 (CHEMBL1649021)
IC50
11±n/a nM
Citation
 Weinberg, LRAlbom, MSAngeles, TSHusten, JLisko, JGMcHugh, RJMilkiewicz, KLMurthy, SOtt, GRTheroff, JPTripathy, RUnderiner, TLZificsak, CADorsey, BD Fused bicyclic derivatives of 2,4-diaminopyrimidine as c-Met inhibitors. Bioorg Med Chem Lett 21:164-7 (2010)  
Target
Name:
Insulin receptor
Synonyms:
INSR INSR_HUMAN Insulin receptor beta subunit
Type:
Receptor Tyrosine Kinase
Mol. Mass.:
156322.60
Organism:
Homo sapiens (Human)
Description:
P06213
Residue:
1382
  
Inhibitor
Name:
BDBM50334086
Synonyms:
2-[5-Chloro-2-(1-methyl-2-oxo-2,3,4,5-tetrahydro-1H-benzo[b]azepin-7-ylamino)-pyrimidin-4-ylamino]-N-propyl-benzamide | CHEMBL1644800
Type:
Small organic molecule
Emp. Form.:
C25H27ClN6O2
Mol. Mass.:
478.974
SMILES:
CCCNC(=O)c1ccccc1Nc1nc(Nc2ccc3N(C)C(=O)CCCc3c2)ncc1Cl
: