Target
Hepatocyte growth factor receptor
Ligand
BDBM50334085
Substrate
Meas. Tech.
ChEMBL_701400 (CHEMBL1649020)
IC50
44±n/a nM
Citation
 Weinberg, LRAlbom, MSAngeles, TSHusten, JLisko, JGMcHugh, RJMilkiewicz, KLMurthy, SOtt, GRTheroff, JPTripathy, RUnderiner, TLZificsak, CADorsey, BD Fused bicyclic derivatives of 2,4-diaminopyrimidine as c-Met inhibitors. Bioorg Med Chem Lett 21:164-7 (2010)  
Target
Name:
Hepatocyte growth factor receptor
Synonyms:
Hepatocyte growth factor receptor Hepatocyte growth factor receptor (c-MET) MET Met proto-oncogene (hepatocyte growth factor receptor) Tyrosine-protein kinase Met (c-Met) c-Met kinase
Type:
Protein
Mol. Mass.:
155559.73
Organism:
Homo sapiens (Human)
Description:
P08581
Residue:
1390
  
Inhibitor
Name:
BDBM50334085
Synonyms:
2-[5-Chloro-2-(1-ethyl-5,5-dimethyl-2-oxo-2,3,4,5-tetrahydro-1H-benzo[b]azepin-8-ylamino)-pyrimidin-4-ylamino]-3-fluoro-N-methyl-benzamide | CHEMBL1644812
Type:
Small organic molecule
Emp. Form.:
C26H28ClFN6O2
Mol. Mass.:
510.991
SMILES:
CCN1c2cc(Nc3ncc(Cl)c(Nc4c(F)cccc4C(=O)NC)n3)ccc2C(C)(C)CCC1=O
: