Target
Mu-type opioid receptor
Ligand
BDBM50334990
Substrate
Meas. Tech.
ChEMBL_702696 (CHEMBL1657770)
EC50
0.060000±n/a nM
Citation
 Cowell, SMHanlon, KE Development of potent µ and d opioid agonists with high lipophilicity. J Med Chem 54:382-6 (2011)  
Target
Name:
Mu-type opioid receptor
Synonyms:
MOR-1 Mu-type opioid receptor (MOR) OPRM_RAT Opioid receptor B Ror-b
Type:
G Protein-Coupled Receptor (GPCR)
Mol. Mass.:
44503.11
Organism:
Rattus norvegicus (rat)
Description:
Competition binding assays were carried out using membrane preparations from transfected HN9.10 cells that constitutively expressed the mu opioid receptor.
Residue:
398
  
Inhibitor
Name:
BDBM50334990
Synonyms:
(R)-2-((S)-2-amino-3-(4-hydroxy-2,6-dimethylphenyl)propanoyl)-N-(2-((S)-3-(4-chlorophenyl)-1-oxo-1-(4-(N-phenylpropionamido)piperidin-1-yl)propan-2-ylamino)-2-oxoethyl)-1,2,3,4-tetrahydroisoquinoline-3-carboxamide | CHEMBL1649948
Type:
Small organic molecule
Emp. Form.:
C46H53ClN6O6
Mol. Mass.:
821.403
SMILES:
CCC(=O)N(C1CCN(CC1)C(=O)[C@H](Cc1ccc(Cl)cc1)NC(=O)CNC(=O)[C@H]1Cc2ccccc2CN1C(=O)[C@@H](N)Cc1c(C)cc(O)cc1C)c1ccccc1
: