Target
Sodium- and chloride-dependent glycine transporter 1
Ligand
BDBM50335011
Substrate
Meas. Tech.
ChEMBL_702705 (CHEMBL1657779)
IC50
370±n/a nM
Citation
 Kohara, ADoihara, HSaita, KAota, M Synthesis and biological evaluation of 3-biphenyl-4-yl-4-phenyl-4H-1,2,4-triazoles as novel glycine transporter 1 inhibitors. J Med Chem 54:387-91 (2011)  
Target
Name:
Sodium- and chloride-dependent glycine transporter 1
Synonyms:
GlyT-1 Glycine transporter 1 Slc6a9 Solute carrier family 6 member 9
Type:
Enzyme Catalytic Domain
Mol. Mass.:
71066.17
Organism:
attus norvegicus (Rat)
Description:
Glycine-1-transporter 0 HUMAN::P28572
Residue:
638
  
Inhibitor
Name:
BDBM50335011
Synonyms:
3-Biphenyl-4-yl-4-(2-fluorophenyl)-5-isopropyl-4H-1,2,4-triazole | CHEMBL1649975
Type:
Small organic molecule
Emp. Form.:
C23H20FN3
Mol. Mass.:
357.4234
SMILES:
CC(C)c1nnc(-c2ccc(cc2)-c2ccccc2)n1-c1ccccc1F
: