Target
Pteridine reductase 1
Ligand
BDBM50335103
Substrate
Meas. Tech.
ChEMBL_702836 (CHEMBL1655366)
IC50
89000±n/a nM
Citation
 Shi, KHuang, QHuang, YLee, TCYu, H Reducing the brittleness of zein films through chemical modification. J Agric Food Chem 59:56-61 (2011)  
Target
Name:
Pteridine reductase 1
Synonyms:
HMTXR PTR1_LEIMA
Type:
PROTEIN
Mol. Mass.:
30459.34
Organism:
Leishmania major
Description:
ChEMBL_1470027
Residue:
288
  
Inhibitor
Name:
BDBM50335103
Synonyms:
3-(5-Amino-[1,3,4]thiadiazol-2-yl)-1-(4-chlorophenyl)-propan-1-one | CHEMBL1650288
Type:
Small organic molecule
Emp. Form.:
C11H10ClN3OS
Mol. Mass.:
267.735
SMILES:
Nc1nnc(CCC(=O)c2ccc(Cl)cc2)s1
: