Target
Pteridine reductase 1
Ligand
BDBM50335105
Substrate
Meas. Tech.
ChEMBL_702837 (CHEMBL1655367)
Ki
2000±n/a nM
Citation
 Shi, KHuang, QHuang, YLee, TCYu, H Reducing the brittleness of zein films through chemical modification. J Agric Food Chem 59:56-61 (2011)  
Target
Name:
Pteridine reductase 1
Synonyms:
HMTXR PTR1_LEIMA
Type:
PROTEIN
Mol. Mass.:
30459.34
Organism:
Leishmania major
Description:
ChEMBL_1470027
Residue:
288
  
Inhibitor
Name:
BDBM50335105
Synonyms:
2-(5-Amino-[1,3,4]thiadiazol-2-yl)-4H-chromen-4-one | CHEMBL1650283
Type:
Small organic molecule
Emp. Form.:
C11H7N3O2S
Mol. Mass.:
245.257
SMILES:
Nc1nnc(s1)-c1cc(=O)c2ccccc2o1
: