Target
Transient receptor potential M8 protein
Ligand
BDBM50335165
Substrate
Meas. Tech.
ChEMBL_701543 (CHEMBL1656182)
IC50
0.2±n/a nM
Citation
 Ballentine, SKColburn, RWDamiano, BPFlores, CMHutchinson, TLIllig, CRLiu, YLubin, MLMa, JMeegalla, SKParks, DJBaker, JFParsons, WHPlayer, MRQin, NSchneider, CRStone, DJ Design and optimization of benzimidazole-containing transient receptor potential melastatin 8 (TRPM8) antagonists. J Med Chem 54:233-47 (2011)  
Target
Name:
Transient receptor potential M8 protein
Synonyms:
Cold-menthol receptor (TRPM8) Transient receptor potential M8 protein Transient receptor potential melastatin subfamily, type 8 (TRPM8)
Type:
Enzyme
Mol. Mass.:
127589.43
Organism:
Canis lupus familiaris (Dog)
Description:
Q1A7N1
Residue:
1104
  
Inhibitor
Name:
BDBM50335165
Synonyms:
3-[2-(1-Oxa-2-aza-spiro[4.5]dec-2-en-3-yl)-6-(2-trifluoromethylphenyl)-3H-benzimidazol-4-yl]-propan-1-ol | CHEMBL1650528
Type:
Small organic molecule
Emp. Form.:
C25H26F3N3O2
Mol. Mass.:
457.488
SMILES:
OCCCc1cc(cc2[nH]c(nc12)C1=NOC2(C1)CCCCC2)-c1ccccc1C(F)(F)F
: