Target
Adenosine deaminase
Ligand
BDBM50335311
Substrate
Meas. Tech.
ChEMBL_702791 (CHEMBL1655234)
Ki
46000±n/a nM
Citation
 Gillerman, IFischer, B Investigations into the origin of the molecular recognition of several adenosine deaminase inhibitors. J Med Chem 54:107-21 (2011)  
Target
Name:
Adenosine deaminase
Synonyms:
ADA Adenosine aminohydrolase
Type:
Enzyme
Mol. Mass.:
40910.44
Organism:
Bos taurus (bovine)
Description:
Residue:
363
  
Inhibitor
Name:
BDBM50335311
Synonyms:
(2R,3R,4S,5R)-2-(2-(benzylamino)-9H-purin-9-yl)-5-(hydroxymethyl)tetrahydrofuran-3,4-diol | CHEMBL1651366
Type:
Small organic molecule
Emp. Form.:
C17H19N5O4
Mol. Mass.:
357.3639
SMILES:
OC[C@H]1O[C@H]([C@H](O)[C@@H]1O)n1cnc2cnc(NCc3ccccc3)nc12
: