Target
Adenosine deaminase
Ligand
BDBM50335312
Substrate
Meas. Tech.
ChEMBL_702791 (CHEMBL1655234)
Ki
4200±n/a nM
Citation
 Gillerman, IFischer, B Investigations into the origin of the molecular recognition of several adenosine deaminase inhibitors. J Med Chem 54:107-21 (2011)  
Target
Name:
Adenosine deaminase
Synonyms:
ADA Adenosine aminohydrolase
Type:
Enzyme
Mol. Mass.:
40910.44
Organism:
Bos taurus (bovine)
Description:
Residue:
363
  
Inhibitor
Name:
BDBM50335312
Synonyms:
(2R,3R,4S,5R)-2-(2-amino-9H-purin-9-yl)-5-(hydroxymethyl)tetrahydrofuran-3,4-diol CHEMBL1651367
Type:
Small organic molecule
Emp. Form.:
C10H13N5O4
Mol. Mass.:
267.2413
SMILES:
Nc1ncc2ncn([C@@H]3O[C@H](CO)[C@@H](O)[C@H]3O)c2n1
: