Target
Cytochrome P450 3A4
Ligand
BDBM50335379
Substrate
Meas. Tech.
ChEMBL_701747 (CHEMBL1656750)
IC50
3000±n/a nM
Citation
 Johnson, DSStiff, CLazerwith, SEKesten, SRFay, LKMorris, MBeidler, DLiimatta, MBSmith, SEDudley, DTSadagopan, NBhattachar, SNKesten, SJNomanbhoy, TKCravatt, BFAhn, K Discovery of PF-04457845: A Highly Potent, Orally Bioavailable, and Selective Urea FAAH Inhibitor. ACS Med Chem Lett 2:91-96 (2011)  
Target
Name:
Cytochrome P450 3A4
Synonyms:
Albendazole monooxygenase CP3A4_HUMAN CYP3A4 CYPIIIA4 Cytochrome P450 3A4 (CYP3A4) Nifedipine oxidase Taurochenodeoxycholate 6-alpha-hydroxylase
Type:
Enzyme
Mol. Mass.:
57349.57
Organism:
Homo sapiens (Human)
Description:
Residue:
503
  
Inhibitor
Name:
BDBM50335379
Synonyms:
CHEMBL1651532 | N-(6-Methylpyridin-3-yl)-4-(3-{[5-(trifluoromethyl)pyridin-2-yl]oxy}benzylidene)piperidine-1-carboxamide
Type:
Small organic molecule
Emp. Form.:
C25H23F3N4O2
Mol. Mass.:
468.4709
SMILES:
[#6]-c1ccc(-[#7]-[#6](=O)-[#7]-2-[#6]-[#6]\[#6](-[#6]-[#6]-2)=[#6]\c2cccc(-[#8]-c3ccc(cn3)C(F)(F)F)c2)cn1
: