Target
Signal transducer and activator of transcription 3
Ligand
BDBM50335435
Substrate
Meas. Tech.
ChEMBL_701933 (CHEMBL1657357)
Kd
39000±n/a nM
Citation
 Shahani, VMYue, PHaftchenary, SZhao, WLukkarila, JLZhang, XBall, DNona, CGunning, PTTurkson, J Identification of Purine-Scaffold Small-Molecule Inhibitors of Stat3 Activation by QSAR Studies. ACS Med Chem Lett 2:79-84 (2011)  
Target
Name:
Signal transducer and activator of transcription 3
Synonyms:
Acute-phase response factor STAT3 alpha Signal transducer and activator of transcription 3 Transcription Factor STAT3
Type:
Cytosolic Transcription Factor
Mol. Mass.:
88050.28
Organism:
Mus musculus (mouse)
Description:
Bacterially expressed protein was used in the FP assay.
Residue:
770
  
Inhibitor
Name:
BDBM50335435
Synonyms:
2-(6-(cyclohexylamino)-2-((4-cyclohexylbenzyl)amino)-9H-purin-9-yl)acetic acid | CHEMBL1651675
Type:
Small organic molecule
Emp. Form.:
C26H34N6O2
Mol. Mass.:
462.5872
SMILES:
OC(=O)Cn1cnc2c(NC3CCCCC3)nc(NCc3ccc(cc3)C3CCCCC3)nc12
: