Target
1-deoxy-D-xylulose 5-phosphate reductoisomerase
Ligand
BDBM50335491
Substrate
Meas. Tech.
ChEMBL_702118 (CHEMBL1655348)
IC50
10000±n/a nM
Citation
 Deng, LEndo, KKato, MCheng, GYajima, SSong, Y Structures of 1-Deoxy-D-Xylulose-5-Phosphate Reductoisomerase/Lipophilic Phosphonate Complexes. ACS Med Chem Lett 2:165-170 (2011)  
Target
Name:
1-deoxy-D-xylulose 5-phosphate reductoisomerase
Synonyms:
1-Deoxy-D-xylulose 5-phosphate reductoisomerase (DXP) 1-deoxy-D-xylulose 5-phosphate reductoisomerase (DXR) DXP reductoisomerase dxr yaeM
Type:
Protein
Mol. Mass.:
43384.52
Organism:
Escherichia coli
Description:
P45568
Residue:
398
  
Inhibitor
Name:
BDBM50335491
Synonyms:
CHEMBL1651841 | Pyridin-3-ylmethylphosphonic acid
Type:
Small organic molecule
Emp. Form.:
C6H8NO3P
Mol. Mass.:
173.1064
SMILES:
OP(O)(=O)Cc1cccnc1
: