Target
Albumin
Ligand
BDBM50370232
Substrate
Meas. Tech.
ChEMBL_705623 (CHEMBL1661507)
Kd
12000±n/a nM
Citation
 Banères-Roquet, FGualtieri, MVillain-Guillot, PPugnière, MLeonetti, JP Use of a surface plasmon resonance method to investigate antibiotic and plasma protein interactions. Antimicrob Agents Chemother 53:1528-31 (2009)  
Target
Name:
Albumin
Synonyms:
ALB Serum albumin
Type:
PROTEIN
Mol. Mass.:
69362.94
Organism:
Homo sapiens (Human)
Description:
ChEMBL_1509401
Residue:
609
  
Inhibitor
Name:
BDBM50370232
Synonyms:
BA-41166E RIFAMPIN Rifampicin
Type:
Small organic molecule
Emp. Form.:
C43H58N4O12
Mol. Mass.:
822.9402
SMILES:
CO[C@H]1\C=C\O[C@@]2(C)Oc3c(C2=O)c2c(O)c(\C=N\N4CCN(C)CC4)c(NC(=O)\C(C)=C/C=C/[C@H](C)[C@H](O)[C@@H](C)[C@@H](O)[C@@H](C)[C@H](OC(C)=O)[C@@H]1C)c(O)c2c(O)c3C
: