Target
Dihydrofolate reductase
Ligand
BDBM18050
Substrate
Meas. Tech.
ChEMBL_710363 (CHEMBL1653324)
IC50
15.0±n/a nM
Citation
 Bourne, CRBunce, RABourne, PCBerlin, KDBarrow, EWBarrow, WW Crystal structure of Bacillus anthracis dihydrofolate reductase with the dihydrophthalazine-based trimethoprim derivative RAB1 provides a structural explanation of potency and selectivity. Antimicrob Agents Chemother 53:3065-73 (2009)  
Target
Name:
Dihydrofolate reductase
Synonyms:
Dihydrofolate Reductase (DHFR) | baDHFR
Type:
Enzyme
Mol. Mass.:
19120.62
Organism:
Bacillus anthracis
Description:
baDHFR was expressed in E. coli BL21, and purified to homogeneity.
Residue:
162
  
Inhibitor
Name:
BDBM18050
Synonyms:
2-[(4-{[(2,4-diaminopteridin-6-yl)methyl](methyl)amino}phenyl)formamido]pentanedioic acid MTX cid_126941
Type:
Small organic molecule
Emp. Form.:
C20H22N8O5
Mol. Mass.:
454.4393
SMILES:
CN(Cc1cnc2nc(N)nc(N)c2n1)c1ccc(cc1)C(=O)N[C@@H](CCC(O)=O)C(O)=O
: