Target
Amine oxidase [flavin-containing] B
Ligand
BDBM15579
Substrate
Meas. Tech.
ChEMBL_714883 (CHEMBL1663829)
IC50
0.017000±n/a nM
Citation
 Hayashi, SNakata, EMorita, AMizuno, KYamamura, KKato, AOhashi, K Discovery of {1-[4-(2-{hexahydropyrrolo[3,4-c]pyrrol-2(1H)-yl}-1H-benzimidazol-1-yl)piperidin-1-yl]cyclooctyl}methanol, systemically potent novel non-peptide agonist of nociceptin/orphanin FQ receptor as analgesic for the treatment of neuropathic pain: design, synthesis, and structure-activity rela Bioorg Med Chem 18:7675-99 (2010)  
Target
Name:
Amine oxidase [flavin-containing] B
Synonyms:
AOFB_HUMAN MAOB Monoamine oxidase type B (MAO B) Monoamine oxidase type B (MAOB)
Type:
Protein
Mol. Mass.:
58768.76
Organism:
Homo sapiens (Human)
Description:
P27338
Residue:
520
  
Inhibitor
Name:
BDBM15579
Synonyms:
CHEMBL972 L-Deprenyl SLG US8633208, Deprenyl methyl[(2R)-1-phenylpropan-2-yl]prop-2-yn-1-ylamine
Type:
Small organic molecule
Emp. Form.:
C13H17N
Mol. Mass.:
187.2808
SMILES:
C[C@H](Cc1ccccc1)N(C)CC#C
: