Target
Steroid hormone receptor ERR1
Ligand
BDBM50336751
Substrate
Meas. Tech.
ChEMBL_718350 (CHEMBL1679770)
IC50
280±n/a nM
Citation
 Patch, RJSearle, LLKim, AJDe, DZhu, XAskari, HBO'Neill, JCAbad, MCRentzeperis, DLiu, JKemmerer, MLin, LKasturi, JGeisler, JGLenhard, JMPlayer, MRGaul, MD Identification of diaryl ether-based ligands for estrogen-related receptora as potential antidiabetic agents. J Med Chem 54:788-808 (2012)  
Target
Name:
Steroid hormone receptor ERR1
Synonyms:
ERR-alpha ERR1_HUMAN ESRRA Estrogen-Related Receptor, alpha NR3B1 Steroid hormone receptor ERR1 Steroid hormone receptor ERR1/Estrogen-related receptor alpha (ERRa) | von Hippel-Lindau disease tumor suppressor/Steroid hormone receptor ERR1
Type:
PROTEIN
Mol. Mass.:
45508.08
Organism:
Homo sapiens (Human)
Description:
ChEMBL_1499891
Residue:
423
  
Inhibitor
Name:
BDBM50336751
Synonyms:
5-[3-Methoxy-4-(4-nitro-3-trifluoromethylphenoxy)benzylidene]-thiazolidine-2,4-dione | CHEMBL1671959
Type:
Small organic molecule
Emp. Form.:
C18H11F3N2O6S
Mol. Mass.:
440.35
SMILES:
COc1cc(C=C2SC(O)=NC2=O)ccc1Oc1ccc(c(c1)C(F)(F)F)[N+]([O-])=O
: