Target
P2Y purinoceptor 2
Ligand
BDBM50336800
Substrate
Meas. Tech.
ChEMBL_718668 (CHEMBL1680819)
IC50
10000±n/a nM
Citation
 Baqi, YHausmann, RRosefort, CRettinger, JSchmalzing, GMüller, CE Discovery of potent competitive antagonists and positive modulators of the P2X2 receptor. J Med Chem 54:817-30 (2012)  
Target
Name:
P2Y purinoceptor 2
Synonyms:
ATP receptor P2RY2 P2U purinoceptor 1 P2Y purinoceptor 2 Purinergic receptor | Purinergic receptor P2Y2
Type:
PROTEIN
Mol. Mass.:
42299.21
Organism:
Homo sapiens (Human)
Description:
ChEMBL_1455361
Residue:
377
  
Inhibitor
Name:
BDBM50336800
Synonyms:
CHEMBL1672101 | Sodium 1-Amino-4-(3-phenoxyphenylamino)-9,10-dioxo-9,10-dihydroanthracene-2-sulfonate
Type:
Small organic molecule
Emp. Form.:
C26H17N2O6S
Mol. Mass.:
485.489
SMILES:
Nc1c(cc(Nc2cccc(Oc3ccccc3)c2)c2C(=O)c3ccccc3C(=O)c12)S([O-])(=O)=O
: