Target
P2X purinoceptor 2
Ligand
BDBM50268685
Substrate
Meas. Tech.
ChEMBL_718656 (CHEMBL1680807)
IC50
1000±n/a nM
Citation
 Baqi, YHausmann, RRosefort, CRettinger, JSchmalzing, GMüller, CE Discovery of potent competitive antagonists and positive modulators of the P2X2 receptor. J Med Chem 54:817-30 (2012)  
Target
Name:
P2X purinoceptor 2
Synonyms:
ATP receptor P2X purinoceptor 2 P2X2/P2X3 receptor Purinergic receptor | Purinergic, P2X2
Type:
Enzyme Catalytic Domain
Mol. Mass.:
52625.55
Organism:
RAT
Description:
Purinergic, P2X2 0 RAT::P49653
Residue:
472
  
Inhibitor
Name:
BDBM50268685
Synonyms:
CHEMBL524064 | sodium 1-amino-4-(2-carboxyphenylamino)-9,10-dioxo-9,10-dihydroanthracene-2-sulfonate
Type:
Small organic molecule
Emp. Form.:
C21H13N2O7S
Mol. Mass.:
437.403
SMILES:
Nc1c(cc(Nc2ccccc2C(O)=O)c2C(=O)c3ccccc3C(=O)c12)S([O-])(=O)=O
: