Target
P2X purinoceptor 4
Ligand
BDBM50336774
Substrate
Meas. Tech.
ChEMBL_718658 (CHEMBL1680809)
IC50
>10000±n/a nM
Citation
 Baqi, YHausmann, RRosefort, CRettinger, JSchmalzing, GMüller, CE Discovery of potent competitive antagonists and positive modulators of the P2X2 receptor. J Med Chem 54:817-30 (2012)  
Target
Name:
P2X purinoceptor 4
Synonyms:
P2RX4_RAT Purinergic, P2X4
Type:
Enzyme Catalytic Domain
Mol. Mass.:
43504.16
Organism:
RAT
Description:
Purinergic, P2X4 0 RAT::P51577
Residue:
388
  
Inhibitor
Name:
BDBM50336774
Synonyms:
CHEMBL598857 | sodium 1-amino-4-(3-carboxyphenylamino)-9,10-dioxo-9,10-dihydroanthracene-2-sulfonate
Type:
Small organic molecule
Emp. Form.:
C21H13N2O7S
Mol. Mass.:
437.403
SMILES:
Nc1c(cc(Nc2cccc(c2)C(O)=O)c2C(=O)c3ccccc3C(=O)c12)S([O-])(=O)=O
: