Target
Dipeptidyl peptidase 4
Ligand
BDBM50336808
Substrate
Meas. Tech.
ChEMBL_718678 (CHEMBL1680829)
IC50
20±n/a nM
Citation
 Miyamoto, YBanno, YYamashita, TFujimoto, TOi, SMoritoh, YAsakawa, TKataoka, OYashiro, HTakeuchi, KSuzuki, NIkedo, KKosaka, TTsubotani, STani, ASasaki, MFunami, MAmano, MYamamoto, YAertgeerts, KYano, JMaezaki, H Discovery of a 3-pyridylacetic acid derivative (TAK-100) as a potent, selective and orally active dipeptidyl peptidase IV (DPP-4) inhibitor. J Med Chem 54:831-50 (2012)  
Target
Name:
Dipeptidyl peptidase 4
Synonyms:
ADABP Adenosine deaminase complexing protein 2 CD_antigen=CD26 DPP4 DPPIV Dipeptidyl peptidase 4 (DPP IV) Dipeptidyl peptidase 4 (DPP4) Dipeptidyl peptidase 4 membrane form Dipeptidyl peptidase IV Dipeptidyl peptidase IV (DDP-IV) Dipeptidyl peptidase IV membrane form Dipeptidyl peptidase-IV (DPP-4) T-cell activation antigen CD26 | TP103
Type:
Enzyme
Mol. Mass.:
88271.01
Organism:
Homo sapiens (Human)
Description:
P27487
Residue:
766
  
Inhibitor
Name:
BDBM50336808
Synonyms:
CHEMBL1672115 | [5-(Aminomethyl)-2-methyl-4-(4-methylphenyl)-6-(2-methylpropyl)pyridin-3-yl]acetic Acid Dihydrochloride
Type:
Small organic molecule
Emp. Form.:
C20H26N2O2
Mol. Mass.:
326.4326
SMILES:
CC(C)Cc1nc(C)c(CC(O)=O)c(-c2ccc(C)cc2)c1CN
: