Target
Dipeptidyl peptidase 2
Ligand
BDBM50336817
Substrate
Meas. Tech.
ChEMBL_718679 (CHEMBL1680830)
IC50
1500±n/a nM
Citation
 Miyamoto, YBanno, YYamashita, TFujimoto, TOi, SMoritoh, YAsakawa, TKataoka, OYashiro, HTakeuchi, KSuzuki, NIkedo, KKosaka, TTsubotani, STani, ASasaki, MFunami, MAmano, MYamamoto, YAertgeerts, KYano, JMaezaki, H Discovery of a 3-pyridylacetic acid derivative (TAK-100) as a potent, selective and orally active dipeptidyl peptidase IV (DPP-4) inhibitor. J Med Chem 54:831-50 (2012)  
Target
Name:
Dipeptidyl peptidase 2
Synonyms:
DPP2_RAT Dpp2 | Dpp7
Type:
PROTEIN
Mol. Mass.:
55100.60
Organism:
Rattus norvegicus
Description:
ChEMBL_718679
Residue:
500
  
Inhibitor
Name:
BDBM50336817
Synonyms:
5-(Aminomethyl)-6-(2,2-dimethylpropyl)-4-(4-methylphenyl)-2-(2-methylpropyl)pyridine-3-carboxylic Acid Dihydrochloride | CHEMBL1672124
Type:
Small organic molecule
Emp. Form.:
C23H32N2O2
Mol. Mass.:
368.5124
SMILES:
CC(C)Cc1nc(CC(C)(C)C)c(CN)c(-c2ccc(C)cc2)c1C(O)=O
: