Target
5-hydroxytryptamine receptor 1E
Ligand
BDBM50336843
Substrate
Meas. Tech.
ChEMBL_718854 (CHEMBL1681236)
Ki
>10000±n/a nM
Citation
 Siméon, FGWendahl, MTPike, VW Syntheses of 2-amino and 2-halothiazole derivatives as high-affinity metabotropic glutamate receptor subtype 5 ligands and potential radioligands for in vivo imaging. J Med Chem 54:901-8 (2012)  
Target
Name:
5-hydroxytryptamine receptor 1E
Synonyms:
5-HT-1E 5-Hydroxytryptamine Receptor Subtype 1E (5HT1E) 5-hydroxytryptamine receptor 1E (5-HT-1E) (S31) 5HT1E_HUMAN S31 Serotonin 1e (5-HT1e) receptor | Serotonin Receptor 1E
Type:
G Protein-Coupled Receptor (GPCR)
Mol. Mass.:
41697.80
Organism:
Homo sapiens (Human)
Description:
gi_112822
Residue:
365
  
Inhibitor
Name:
BDBM50336843
Synonyms:
3-((2-Fluorothiazol-4-yl)ethynyl)-5-fluorobenzonitrile | CHEMBL1672288
Type:
Small organic molecule
Emp. Form.:
C12H4F2N2S
Mol. Mass.:
246.235
SMILES:
Fc1nc(cs1)C#Cc1cc(F)cc(c1)C#N
: