Target
D(1A) dopamine receptor
Ligand
BDBM50336843
Substrate
Meas. Tech.
ChEMBL_718872 (CHEMBL1681366)
Ki
>10000±n/a nM
Citation
 Siméon, FGWendahl, MTPike, VW Syntheses of 2-amino and 2-halothiazole derivatives as high-affinity metabotropic glutamate receptor subtype 5 ligands and potential radioligands for in vivo imaging. J Med Chem 54:901-8 (2012)  
Target
Name:
D(1A) dopamine receptor
Synonyms:
DA D1 receptor DRD1 Dopamine D1 receptor Dopamine D1A
Type:
Enzyme
Mol. Mass.:
49303.43
Organism:
Homo sapiens (Human)
Description:
P21728
Residue:
446
  
Inhibitor
Name:
BDBM50336843
Synonyms:
3-((2-Fluorothiazol-4-yl)ethynyl)-5-fluorobenzonitrile | CHEMBL1672288
Type:
Small organic molecule
Emp. Form.:
C12H4F2N2S
Mol. Mass.:
246.235
SMILES:
Fc1nc(cs1)C#Cc1cc(F)cc(c1)C#N
: