Target
Metabotropic glutamate receptor 8
Ligand
BDBM50336843
Substrate
Meas. Tech.
ChEMBL_718174 (CHEMBL1679220)
Ki
>10000±n/a nM
Citation
 Siméon, FGWendahl, MTPike, VW Syntheses of 2-amino and 2-halothiazole derivatives as high-affinity metabotropic glutamate receptor subtype 5 ligands and potential radioligands for in vivo imaging. J Med Chem 54:901-8 (2012)  
Target
Name:
Metabotropic glutamate receptor 8
Synonyms:
GPRC1H GRM8_HUMAN Metabotropic glutamate receptor 8 | metabotropic glutamate 8
Type:
Enzyme Catalytic Domain
Mol. Mass.:
101759.58
Organism:
Homo sapiens (Human)
Description:
metabotropic glutamate 8 GRM8 HUMAN::O00222
Residue:
908
  
Inhibitor
Name:
BDBM50336843
Synonyms:
3-((2-Fluorothiazol-4-yl)ethynyl)-5-fluorobenzonitrile | CHEMBL1672288
Type:
Small organic molecule
Emp. Form.:
C12H4F2N2S
Mol. Mass.:
246.235
SMILES:
Fc1nc(cs1)C#Cc1cc(F)cc(c1)C#N
: