Target
Lysosomal alpha-glucosidase
Ligand
BDBM50338669
Substrate
Meas. Tech.
ChEMBL_726859 (CHEMBL1686565)
IC50
8000±n/a nM
Citation
 Xie, WTanabe, GAkaki, JMorikawa, TNinomiya, KMinematsu, TYoshikawa, MWu, XMuraoka, O Isolation, structure identification and SAR studies on thiosugar sulfonium salts, neosalaprinol and neoponkoranol, as potenta-glucosidase inhibitors. Bioorg Med Chem 19:2015-22 (2011)  
Target
Name:
Lysosomal alpha-glucosidase
Synonyms:
Acidic alpha-glucosidase LYAG_RAT
Type:
PROTEIN
Mol. Mass.:
106191.24
Organism:
Rattus norvegicus
Description:
ChEMBL_1506157
Residue:
953
  
Inhibitor
Name:
BDBM50338669
Synonyms:
CHEMBL1684162 | Neosalacinol
Type:
Small organic molecule
Emp. Form.:
C9H18O6S
Mol. Mass.:
254.301
SMILES:
OC[C@H]([O-])[C@H](O)C[S@@+]1C[C@@H](O)[C@H](O)[C@H]1CO
: