Target
Pleiotropic ABC efflux transporter of multiple drugs
Ligand
BDBM50012855
Substrate
Meas. Tech.
ChEMBL_730212 (CHEMBL1696307)
IC50
>400000±n/a nM
Citation
 Kolaczkowski, MKolaczkowska, AMotohashi, NMichalak, K New high-throughput screening assay to reveal similarities and differences in inhibitory sensitivities of multidrug ATP-binding cassette transporters. Antimicrob Agents Chemother 53:1516-27 (2009)  
Target
Name:
Pleiotropic ABC efflux transporter of multiple drugs
Synonyms:
LEM1 PDR5_YEAST STS1 YDR1
Type:
PROTEIN
Mol. Mass.:
170453.87
Organism:
Saccharomyces cerevisiae S288c
Description:
ChEMBL_730212
Residue:
1511
  
Inhibitor
Name:
BDBM50012855
Synonyms:
10H-Phenothiazin CHEMBL828 dibenzo-1,4-thiazine | phenothiazine
Type:
Small organic molecule
Emp. Form.:
C12H9NS
Mol. Mass.:
199.272
SMILES:
N1c2ccccc2Sc2ccccc12
: