Target
Disks large homolog 4
Ligand
BDBM50339569
Substrate
Meas. Tech.
ChEMBL_736705 (CHEMBL1695086)
Ki
8300±n/a nM
Citation
 Bach, AEildal, JNStuhr-Hansen, NDeeskamp, RGottschalk, MPedersen, SWKristensen, ASStrømgaard, K Cell-permeable and plasma-stable peptidomimetic inhibitors of the postsynaptic density-95/N-methyl-D-aspartate receptor interaction. J Med Chem 54:1333-46 (2011)  
Target
Name:
Disks large homolog 4
Synonyms:
DLG4 PSD95
Type:
PROTEIN
Mol. Mass.:
80483.80
Organism:
Homo sapiens (Human)
Description:
ChEMBL_736705
Residue:
724
  
Inhibitor
Name:
BDBM50339569
Synonyms:
(2S,5S,8S,11S)-11-(2-carboxyethyl)-14-(3,4-dichlorophenyl)-8-((R)-1-hydroxyethyl)-2-isopropyl-5-methyl-7,10-dioxo-4-thioxo-3,6,9,12-tetraazatetradecan-1-oic acid | CHEMBL1688633
Type:
Small organic molecule
Emp. Form.:
C25H36Cl2N4O7S
Mol. Mass.:
607.547
SMILES:
CC(C)[C@H](NC(=S)[C@H](C)NC(=O)[C@@H](NC(=O)[C@H](CCC(O)=O)NCCc1ccc(Cl)c(Cl)c1)[C@@H](C)O)C(O)=O
: