Target
Substance-P receptor
Ligand
BDBM50418331
Substrate
Meas. Tech.
ChEMBL_743623 (CHEMBL1768166)
IC50
12.59±n/a nM
Citation
 Giuliani, GCappelli, AMatarrese, MMasiello, VTurolla, EAMonterisi, CFazio, FAnzini, MPericot Mohr, GRiitano, DFinetti, FMorbidelli, LZiche, MGiorgi, GVomero, S Non-peptide NK1 receptor ligands based on the 4-phenylpyridine moiety. Bioorg Med Chem 19:2242-51 (2011)  
Target
Name:
Substance-P receptor
Synonyms:
NK-1 receptor NK1 Receptor Neurokinin 1 receptor SPR Tac1r Tacr1
Type:
G Protein-Coupled Receptor (GPCR)
Mol. Mass.:
46371.54
Organism:
Rattus norvegicus (rat)
Description:
Competition binding assays were carried out using membrane preparations from transfected CHO cells that constitutively expressed the rat NK1 receptor.
Residue:
407
  
Inhibitor
Name:
BDBM50418331
Synonyms:
SPERGUALIN
Type:
Small organic molecule
Emp. Form.:
C31H24ClF6N3O2
Mol. Mass.:
619.985
SMILES:
FC(F)(F)c1cc(cc(c1)C(F)(F)F)C(=O)N1CC[C@@H](C[C@H]1Cc1ccc(Cl)cc1)NC(=O)c1ccnc2ccccc12
: