Target
Calmodulin-domain protein kinase 1
Ligand
BDBM50345727
Substrate
Meas. Tech.
ChEMBL_750529 (CHEMBL1786290)
IC50
14±n/a nM
Citation
 Murphy, RCOjo, KKLarson, ETCastellanos-Gonzalez, APerera, BGKeyloun, KRKim, JEBhandari, JGMuller, NRVerlinde, CLWhite, ACMerritt, EAVan Voorhis, WCMaly, DJ Discovery of Potent and Selective Inhibitors of Calcium-Dependent Protein Kinase 1 (CDPK1) from C. parvum and T. gondii. ACS Med Chem Lett 1:331-335 (2011)  
Target
Name:
Calmodulin-domain protein kinase 1
Synonyms:
Calmodulin-domain protein kinase 1 Calmodulin-domain protein kinase, putative
Type:
Enzyme Catalytic Domain
Mol. Mass.:
57248.42
Organism:
Toxoplasma gondii
Description:
Residue:
507
  
Inhibitor
Name:
BDBM50345727
Synonyms:
1-isopropyl-3-(3-isopropylphenyl)-1H-pyrazolo[3,4-d]pyrimidin-4-amine US10544104, Compound 7e US9765037, Compound 7e
Type:
Small organic molecule
Emp. Form.:
C17H21N5
Mol. Mass.:
295.3821
SMILES:
CC(C)c1cccc(c1)-c1nn(C(C)C)c2ncnc(N)c12
: