Target
Calmodulin-domain protein kinase 1
Ligand
BDBM50345738
Substrate
Meas. Tech.
ChEMBL_750529 (CHEMBL1786290)
IC50
5±n/a nM
Citation
 Murphy, RCOjo, KKLarson, ETCastellanos-Gonzalez, APerera, BGKeyloun, KRKim, JEBhandari, JGMuller, NRVerlinde, CLWhite, ACMerritt, EAVan Voorhis, WCMaly, DJ Discovery of Potent and Selective Inhibitors of Calcium-Dependent Protein Kinase 1 (CDPK1) from C. parvum and T. gondii. ACS Med Chem Lett 1:331-335 (2011)  
Target
Name:
Calmodulin-domain protein kinase 1
Synonyms:
Calmodulin-domain protein kinase 1 Calmodulin-domain protein kinase, putative
Type:
Enzyme Catalytic Domain
Mol. Mass.:
57248.42
Organism:
Toxoplasma gondii
Description:
Residue:
507
  
Inhibitor
Name:
BDBM50345738
Synonyms:
1-isopropyl-3-(naphthalen-2-yl)-1H-pyrazolo[3,4-d]pyrimidin-4-amine CHEMBL2069956 US11247972, Compound 7p | US9765037, Compound 7p
Type:
Small organic molecule
Emp. Form.:
C18H17N5
Mol. Mass.:
303.3611
SMILES:
CC(C)n1nc(-c2ccc3ccccc3c2)c2c(N)ncnc12
: