Target
Calmodulin-domain protein kinase 1
Ligand
BDBM50345723
Substrate
Meas. Tech.
ChEMBL_750529 (CHEMBL1786290)
IC50
18±n/a nM
Citation
 Murphy, RCOjo, KKLarson, ETCastellanos-Gonzalez, APerera, BGKeyloun, KRKim, JEBhandari, JGMuller, NRVerlinde, CLWhite, ACMerritt, EAVan Voorhis, WCMaly, DJ Discovery of Potent and Selective Inhibitors of Calcium-Dependent Protein Kinase 1 (CDPK1) from C. parvum and T. gondii. ACS Med Chem Lett 1:331-335 (2011)  
Target
Name:
Calmodulin-domain protein kinase 1
Synonyms:
Calmodulin-domain protein kinase 1 Calmodulin-domain protein kinase, putative
Type:
Enzyme Catalytic Domain
Mol. Mass.:
57248.42
Organism:
Toxoplasma gondii
Description:
Residue:
507
  
Inhibitor
Name:
BDBM50345723
Synonyms:
3-(4-chlorophenyl)-1-isopropyl-1H-pyrazolo[3,4-d]pyrimidin-4-amine US10544104, Compound 7a US9765037, Compound 7a
Type:
Small organic molecule
Emp. Form.:
C14H14ClN5
Mol. Mass.:
287.747
SMILES:
CC(C)n1nc(-c2ccc(Cl)cc2)c2c(N)ncnc12
: