Target
Mu-type opioid receptor
Ligand
BDBM50346948
Substrate
Meas. Tech.
ChEMBL_753181 (CHEMBL1799274)
Ki
1.1±n/a nM
Citation
 Majumdar, SBurgman, MHaselton, NGrinnell, SOcampo, JPasternak, ARPasternak, GW Generation of novel radiolabeled opiates through site-selective iodination. Bioorg Med Chem Lett 21:4001-4 (2011)  
Target
Name:
Mu-type opioid receptor
Synonyms:
M-OR-1 MOR-1 MUOR1 Mu opiate receptor OPRM1 hMOP | mu-type opioid receptor isoform MOR-1
Type:
G Protein-Coupled Receptor (GPCR)
Mol. Mass.:
44789.51
Organism:
Homo sapiens (Human)
Description:
P35372
Residue:
400
  
Inhibitor
Name:
BDBM50346948
Synonyms:
CHEMBL1795717 | CTAP-NH2
Type:
Small organic molecule
Emp. Form.:
C51H69N13O11S2
Mol. Mass.:
1104.304
SMILES:
C[C@@H](O)[C@H](NC(=O)[C@H]1NC(=O)[C@@H](NC(=O)[C@H](CCCN=C(N)N)NC(=O)[C@@H](Cc2c[nH]c3ccccc23)NC(=O)[C@H](Cc2ccc(O)cc2)NC(=O)[C@H](CSSC1(C)C)NC(=O)[C@H](N)Cc1ccccc1)[C@@H](C)O)C(N)=O
: