Target
Mu-type opioid receptor
Ligand
BDBM50346951
Substrate
Meas. Tech.
ChEMBL_753176 (CHEMBL1799269)
Kd
0.110000±n/a nM
Citation
 Majumdar, SBurgman, MHaselton, NGrinnell, SOcampo, JPasternak, ARPasternak, GW Generation of novel radiolabeled opiates through site-selective iodination. Bioorg Med Chem Lett 21:4001-4 (2011)  
Target
Name:
Mu-type opioid receptor
Synonyms:
M-OR-1 MOR-1 MUOR1 Mu opiate receptor OPRM1 hMOP | mu-type opioid receptor isoform MOR-1
Type:
G Protein-Coupled Receptor (GPCR)
Mol. Mass.:
44789.51
Organism:
Homo sapiens (Human)
Description:
P35372
Residue:
400
  
Inhibitor
Name:
BDBM50346951
Synonyms:
CHEMBL1795711 | CHEMBL1795714
Type:
Small organic molecule
Emp. Form.:
C27H29IN2O4
Mol. Mass.:
572.4346
SMILES:
Oc1ccc2C[C@H]3N(CC4CC4)CC[C@@]45[C@@H](Oc1c24)[C@@H](CC[C@@]35O)NC(=O)c1cccc(I)c1
: