Target
Potassium voltage-gated channel subfamily H member 2
Ligand
BDBM50350022
Substrate
Meas. Tech.
ChEMBL_761736 (CHEMBL1816830)
IC50
13000±n/a nM
Citation
 Hudkins, RLRaddatz, RTao, MMathiasen, JRAimone, LDBecknell, NCProuty, CPKnutsen, LJYazdanian, MMoachon, GAtor, MAMallamo, JPMarino, MJBacon, ERWilliams, M Discovery and characterization of 6-{4-[3-(R)-2-methylpyrrolidin-1-yl)propoxy]phenyl}-2H-pyridazin-3-one (CEP-26401, irdabisant): a potent, selective histamine H3 receptor inverse agonist. J Med Chem 54:4781-92 (2011)  
Target
Name:
Potassium voltage-gated channel subfamily H member 2
Synonyms:
1,3-beta-glucan synthase component GLS2 ERG Eag-related protein 1 Ether-a-go-go-related gene (HERG) Ether-a-go-go-related gene potassium channel 1 Ether-a-go-go-related gene potassium channel 1 (hERG1) Ether-a-go-go-related protein 1 H-ERG KCNH2 Potassium voltage-gated channel subfamily H member 2 (hERG) Voltage-gated potassium channel subunit Kv11.1 hERG Potassium Channel 1 | putative potassium channel subunit
Type:
Multi-pass membrane protein
Mol. Mass.:
126672.65
Organism:
Homo sapiens (Human)
Description:
Q12809
Residue:
1159
  
Inhibitor
Name:
BDBM50350022
Synonyms:
CHEMBL1813057
Type:
Small organic molecule
Emp. Form.:
C19H25N3O2
Mol. Mass.:
327.4207
SMILES:
C[C@@H]1CCCN1CCCOc1ccc(cc1)-c1ccc(=O)n(C)n1
: