Target
Histamine H3 receptor
Ligand
BDBM50350032
Substrate
Meas. Tech.
ChEMBL_761529 (CHEMBL1817409)
Ki
106±n/a nM
Citation
 Hudkins, RLRaddatz, RTao, MMathiasen, JRAimone, LDBecknell, NCProuty, CPKnutsen, LJYazdanian, MMoachon, GAtor, MAMallamo, JPMarino, MJBacon, ERWilliams, M Discovery and characterization of 6-{4-[3-(R)-2-methylpyrrolidin-1-yl)propoxy]phenyl}-2H-pyridazin-3-one (CEP-26401, irdabisant): a potent, selective histamine H3 receptor inverse agonist. J Med Chem 54:4781-92 (2011)  
Target
Name:
Histamine H3 receptor
Synonyms:
HH3R Hrh3
Type:
G Protein-Coupled Receptor (GPCR)
Mol. Mass.:
48607.98
Organism:
Rattus norvegicus (rat)
Description:
Residue:
445
  
Inhibitor
Name:
BDBM50350032
Synonyms:
CHEMBL1813062
Type:
Small organic molecule
Emp. Form.:
C19H25N3O2
Mol. Mass.:
327.4207
SMILES:
Cn1nc(ccc1=O)-c1ccc(OCCCN2CCCCC2)cc1
: