Target
Solute carrier family 15 member 2
Ligand
BDBM50169178
Substrate
Meas. Tech.
ChEMBL_762551 (CHEMBL1817008)
Ki
9000±n/a nM
Citation
 Pedretti, ADe Luca, LMarconi, CRegazzoni, LAldini, GVistoli, G Fragmental modeling of hPepT2 and analysis of its binding features by docking studies and pharmacophore mapping. Bioorg Med Chem 19:4544-51 (2011)  
Target
Name:
Solute carrier family 15 member 2
Synonyms:
Kidney H(+)/peptide cotransporter PEPT2 S15A2_HUMAN | SLC15A2
Type:
PROTEIN
Mol. Mass.:
81795.62
Organism:
Homo sapiens (Human)
Description:
ChEMBL_762551
Residue:
729
  
Inhibitor
Name:
BDBM50169178
Synonyms:
(S)-2-[(S)-2-Amino-3-(4-hydroxy-phenyl)-propionylamino]-3-phenyl-propionic acid | CHEMBL447844
Type:
Small organic molecule
Emp. Form.:
C18H20N2O4
Mol. Mass.:
328.3624
SMILES:
N[C@@H](Cc1ccc(O)cc1)C(=O)N[C@@H](Cc1ccccc1)C(O)=O
: