Target
Solute carrier family 15 member 2
Ligand
BDBM50169188
Substrate
Meas. Tech.
ChEMBL_762551 (CHEMBL1817008)
Ki
9000±n/a nM
Citation
 Pedretti, ADe Luca, LMarconi, CRegazzoni, LAldini, GVistoli, G Fragmental modeling of hPepT2 and analysis of its binding features by docking studies and pharmacophore mapping. Bioorg Med Chem 19:4544-51 (2011)  
Target
Name:
Solute carrier family 15 member 2
Synonyms:
Kidney H(+)/peptide cotransporter PEPT2 S15A2_HUMAN | SLC15A2
Type:
PROTEIN
Mol. Mass.:
81795.62
Organism:
Homo sapiens (Human)
Description:
ChEMBL_762551
Residue:
729
  
Inhibitor
Name:
BDBM50169188
Synonyms:
(S)-2-[(S)-2-((S)-2-Amino-3-methyl-butyrylamino)-propionylamino]-4-methyl-pentanoic acid | CHEMBL189887
Type:
Small organic molecule
Emp. Form.:
C14H27N3O4
Mol. Mass.:
301.3819
SMILES:
CC(C)C[C@H](NC(=O)[C@H](C)NC(=O)[C@@H](N)C(C)C)C(O)=O
: