Target
Dipeptidyl peptidase 4
Ligand
BDBM123781
Substrate
Meas. Tech.
ChEMBL_762817 (CHEMBL1816174)
IC50
38000±n/a nM
Citation
 Banno, YMiyamoto, YSasaki, MOi, SAsakawa, TKataoka, OTakeuchi, KSuzuki, NIkedo, KKosaka, TTsubotani, STani, AFunami, MTawada, MYamamoto, YAertgeerts, KYano, JMaezaki, H Identification of 3-aminomethyl-1,2-dihydro-4-phenyl-1-isoquinolones: a new class of potent, selective, and orally active non-peptide dipeptidyl peptidase IV inhibitors that form a unique interaction with Lys554. Bioorg Med Chem 19:4953-70 (2011)  
Target
Name:
Dipeptidyl peptidase 4
Synonyms:
Bile canaliculus domain-specific membrane glycoprotein Cd26 DPP4_RAT Dipeptidyl peptidase 4 Dipeptidyl peptidase 4 60 kDa soluble form Dipeptidyl peptidase 4 soluble form Dipeptidyl peptidase IV 60 kDa soluble form Dipeptidyl peptidase IV soluble form GP110 glycoprotein | T-cell activation antigen CD26
Type:
Enzyme
Mol. Mass.:
88084.94
Organism:
Rattus norvegicus (rat)
Description:
Residue:
767
  
Inhibitor
Name:
BDBM123781
Synonyms:
3-(aminomethyl)-2-(2-methylpropyl)-1-oxo-4- phenylisoquinoline-6-carboxamide (21) | CHEMBL1812901
Type:
Small organic molecule
Emp. Form.:
C21H23N3O2
Mol. Mass.:
349.4262
SMILES:
CC(C)Cn1c(CN)c(-c2ccccc2)c2cc(ccc2c1=O)C(N)=O
: