Target
Histamine H3 receptor
Ligand
BDBM50352803
Substrate
Meas. Tech.
ChEMBL_767071 (CHEMBL1826120)
Ki
>1000±n/a nM
Citation
 Sundar, BGBailey, TBacon, EAimone, LHuang, ZLyons, JRaddatz, RHudkins, R Amine-constrained pyridazinone histamine H3 receptor antagonists. Bioorg Med Chem Lett 21:5543-6 (2011)  
Target
Name:
Histamine H3 receptor
Synonyms:
HH3R Hrh3
Type:
G Protein-Coupled Receptor (GPCR)
Mol. Mass.:
48607.98
Organism:
Rattus norvegicus (rat)
Description:
Residue:
445
  
Inhibitor
Name:
BDBM50352803
Synonyms:
CHEMBL1823407
Type:
Small organic molecule
Emp. Form.:
C18H22N4O
Mol. Mass.:
310.3935
SMILES:
Cn1nc(ccc1=O)-c1ccc(cc1)N1CCN2CCC[C@H]2C1
: