Target
Histamine H3 receptor
Ligand
BDBM50352807
Substrate
Meas. Tech.
ChEMBL_767071 (CHEMBL1826120)
Ki
46±n/a nM
Citation
 Sundar, BGBailey, TBacon, EAimone, LHuang, ZLyons, JRaddatz, RHudkins, R Amine-constrained pyridazinone histamine H3 receptor antagonists. Bioorg Med Chem Lett 21:5543-6 (2011)  
Target
Name:
Histamine H3 receptor
Synonyms:
HH3R Hrh3
Type:
G Protein-Coupled Receptor (GPCR)
Mol. Mass.:
48607.98
Organism:
Rattus norvegicus (rat)
Description:
Residue:
445
  
Inhibitor
Name:
BDBM50352807
Synonyms:
CHEMBL1823412
Type:
Small organic molecule
Emp. Form.:
C20H24N4O2
Mol. Mass.:
352.4302
SMILES:
O=C(N1CCC[C@H]1CN1CCCC1)c1ccc(cc1)-c1ccc(=O)[nH]n1
: