Target
Histamine H3 receptor
Ligand
BDBM50352797
Substrate
Meas. Tech.
ChEMBL_767070 (CHEMBL1826119)
Ki
>1000±n/a nM
Citation
 Sundar, BGBailey, TBacon, EAimone, LHuang, ZLyons, JRaddatz, RHudkins, R Amine-constrained pyridazinone histamine H3 receptor antagonists. Bioorg Med Chem Lett 21:5543-6 (2011)  
Target
Name:
Histamine H3 receptor
Synonyms:
G-protein coupled receptor 97 HH3R HRH3 Histamine H3 receptor (H3) Histamine receptor (H3 and H4)
Type:
G Protein-Coupled Receptor (GPCR)
Mol. Mass.:
48691.47
Organism:
Homo sapiens (Human)
Description:
Binding assays were using CHO cells stably expressing hH3R receptors.
Residue:
445
  
Inhibitor
Name:
BDBM50352797
Synonyms:
CHEMBL1821744
Type:
Small organic molecule
Emp. Form.:
C19H22N4O2
Mol. Mass.:
338.4036
SMILES:
Cn1nc(ccc1=O)-c1ccc(cc1)C(=O)N1CCN2CCC[C@H]2C1
: