Target
Histamine H3 receptor
Ligand
BDBM50353172
Substrate
Meas. Tech.
ChEMBL_768665 (CHEMBL1832772)
EC50
1.3±n/a nM
Citation
 Hudkins, RLAimone, LDBailey, TRBendesky, RJDandu, RRDunn, DGruner, JAJosef, KALin, YGLyons, JMarcy, VRMathiasen, JRSundar, BGTao, MZulli, ALRaddatz, RBacon, ER Identification of pyridazin-3-one derivatives as potent, selective histamine H3 receptor inverse agonists with robust wake activity. Bioorg Med Chem Lett 21:5493-7 (2011)  
Target
Name:
Histamine H3 receptor
Synonyms:
G-protein coupled receptor 97 HH3R HRH3 Histamine H3 receptor (H3) Histamine receptor (H3 and H4)
Type:
G Protein-Coupled Receptor (GPCR)
Mol. Mass.:
48691.47
Organism:
Homo sapiens (Human)
Description:
Binding assays were using CHO cells stably expressing hH3R receptors.
Residue:
445
  
Inhibitor
Name:
BDBM50353172
Synonyms:
CHEMBL1829477
Type:
Small organic molecule
Emp. Form.:
C19H24FN3O2
Mol. Mass.:
345.4112
SMILES:
C[C@@H]1CCCN1CCCOc1ccc(cc1F)-c1ccc(=O)n(C)n1
: