Target
Histamine H3 receptor
Ligand
BDBM50353179
Substrate
Meas. Tech.
ChEMBL_768593 (CHEMBL1832612)
Ki
70±n/a nM
Citation
 Hudkins, RLAimone, LDBailey, TRBendesky, RJDandu, RRDunn, DGruner, JAJosef, KALin, YGLyons, JMarcy, VRMathiasen, JRSundar, BGTao, MZulli, ALRaddatz, RBacon, ER Identification of pyridazin-3-one derivatives as potent, selective histamine H3 receptor inverse agonists with robust wake activity. Bioorg Med Chem Lett 21:5493-7 (2011)  
Target
Name:
Histamine H3 receptor
Synonyms:
HH3R Hrh3
Type:
G Protein-Coupled Receptor (GPCR)
Mol. Mass.:
48607.98
Organism:
Rattus norvegicus (rat)
Description:
Residue:
445
  
Inhibitor
Name:
BDBM50353179
Synonyms:
CHEMBL1829484
Type:
Small organic molecule
Emp. Form.:
C17H22N4O2
Mol. Mass.:
314.3822
SMILES:
C[C@@H]1CCCN1CCCOc1ccc(cn1)-c1ccc(=O)[nH]n1
: