Target
Sigma non-opioid intracellular receptor 1
Ligand
BDBM50048866
Substrate
Meas. Tech.
ChEMBL_768720 (CHEMBL1831503)
Ki
0.38±n/a nM
Citation
 Abate, CFerorelli, SContino, MMarottoli, RColabufo, NAPerrone, RBerardi, F Arylamides hybrids of two high-affinitys2 receptor ligands as tools for the development of PET radiotracers. Eur J Med Chem 46:4733-41 (2011)  
Target
Name:
Sigma non-opioid intracellular receptor 1
Synonyms:
OPRS1 SIGMAR1 Sigma non-opioid intracellular receptor 1 Sigma1-receptor Sterol isomerase-like protein
Type:
Protein
Mol. Mass.:
25307.17
Organism:
Cavia porcellus (Guinea pig)
Description:
Q60492
Residue:
223
  
Inhibitor
Name:
BDBM50048866
Synonyms:
1-Cyclohexyl-4-[3-(5-methoxy-1,2,3,4-tetrahydro-naphthalen-1-yl)-propyl]-piperazine 1-cyclohexyl-4-[3-(5-methoxy-1,2,3,4-tetrahydro-naphthalen-1-yl)propyl]piperazine CHEMBL53325 | PB-28
Type:
Small organic molecule
Emp. Form.:
C24H38N2O
Mol. Mass.:
370.5713
SMILES:
COc1cccc2C(CCCN3CCN(CC3)C3CCCCC3)CCCc12
: