Target
Cytochrome P450 1A2
Ligand
BDBM50355122
Substrate
Meas. Tech.
ChEMBL_772496 (CHEMBL1839388)
IC50
>30000±n/a nM
Citation
 Tao, MRaddatz, RAimone, LDHudkins, RL Synthesis and structure-activity relationships of 4,5-fused pyridazinones as histamine H3 receptor antagonists. Bioorg Med Chem Lett 21:6126-30 (2011)  
Target
Name:
Cytochrome P450 1A2
Synonyms:
CP1A2_HUMAN CYPIA2 Cytochrome P(3)450 Cytochrome P450 1A2 (CYP1A2) Cytochrome P450-P3
Type:
Enzyme
Mol. Mass.:
58423.38
Organism:
Homo sapiens (Human)
Description:
P05177
Residue:
516
  
Inhibitor
Name:
BDBM50355122
Synonyms:
CHEMBL1835784
Type:
Small organic molecule
Emp. Form.:
C22H31N3O2
Mol. Mass.:
369.5004
SMILES:
C[C@@H]1CCCN1CCCOc1ccc(cc1)C1=NN(C)C(=O)C2CCCC12
: