Target
Histamine H3 receptor
Ligand
BDBM50350022
Substrate
Meas. Tech.
ChEMBL_772497 (CHEMBL1839389)
Ki
6.3±n/a nM
Citation
 Tao, MRaddatz, RAimone, LDHudkins, RL Synthesis and structure-activity relationships of 4,5-fused pyridazinones as histamine H3 receptor antagonists. Bioorg Med Chem Lett 21:6126-30 (2011)  
Target
Name:
Histamine H3 receptor
Synonyms:
HH3R Hrh3
Type:
G Protein-Coupled Receptor (GPCR)
Mol. Mass.:
48607.98
Organism:
Rattus norvegicus (rat)
Description:
Residue:
445
  
Inhibitor
Name:
BDBM50350022
Synonyms:
CHEMBL1813057
Type:
Small organic molecule
Emp. Form.:
C19H25N3O2
Mol. Mass.:
327.4207
SMILES:
C[C@@H]1CCCN1CCCOc1ccc(cc1)-c1ccc(=O)n(C)n1
: