Target
TGF-beta receptor type-1
Ligand
BDBM50355182
Substrate
Meas. Tech.
ChEMBL_772820 (CHEMBL1837692)
IC50
4.37±n/a nM
Citation
 Jin, CHKrishnaiah, MSreenu, DSubrahmanyam, VBRao, KSMohan, AVPark, CYSon, JYSheen, YYKim, DK Synthesis and biological evaluation of 1-substituted-3-(6-methylpyridin-2-yl)-4-([1,2,4]triazolo[1,5-a]pyridin-6-yl)pyrazoles as transforming growth factor-ß type 1 receptor kinase inhibitors. Bioorg Med Chem Lett 21:6049-53 (2011)  
Target
Name:
TGF-beta receptor type-1
Synonyms:
ALK-5 Activin A receptor type II-like protein kinase of 53kD SKR4 TGF-beta receptor type I TGFBR1 TGFR1_HUMAN Transforming growth factor-beta receptor type I
Type:
enzyme
Mol. Mass.:
55968.24
Organism:
Homo sapiens (Human)
Description:
P36897
Residue:
503
  
Inhibitor
Name:
BDBM50355182
Synonyms:
CHEMBL1835629
Type:
Small organic molecule
Emp. Form.:
C24H21N7O2S
Mol. Mass.:
471.534
SMILES:
COc1ccc(NC(=S)n2cc(c(n2)-c2cccc(C)n2)-c2ccc3ncnn3c2)cc1OC
: