Target
DNA-directed DNA/RNA polymerase mu
Ligand
BDBM50356642
Substrate
Meas. Tech.
ChEMBL_785408 (CHEMBL1919787)
IC50
7900±n/a nM
Citation
 Maruo, SKuriyama, IKuramochi, KTsubaki, KYoshida, HMizushina, Y Inhibitory effect of novel 5-O-acyl juglones on mammalian DNA polymerase activity, cancer cell growth and inflammatory response. Bioorg Med Chem 19:5803-12 (2011)  
Target
Name:
DNA-directed DNA/RNA polymerase mu
Synonyms:
DPOLM_HUMAN Pol Mu polmu
Type:
PROTEIN
Mol. Mass.:
54829.49
Organism:
Homo sapiens (Human)
Description:
ChEMBL_1297319
Residue:
494
  
Inhibitor
Name:
BDBM50356642
Synonyms:
CHEMBL1917196
Type:
Small organic molecule
Emp. Form.:
C22H28O4
Mol. Mass.:
356.4553
SMILES:
CCCCCCCCCCCC(=O)Oc1cccc2C(=O)C=CC(=O)c12
: