Target
Inosine-5'-monophosphate dehydrogenase
Ligand
BDBM50365447
Substrate
Meas. Tech.
ChEMBL_807435 (CHEMBL1960806)
IC50
22±n/a nM
Citation
 Kirubakaran, SGorla, SKSharling, LZhang, MLiu, XRay, SSMacpherson, ISStriepen, BHedstrom, LCuny, GD Structure-activity relationship study of selective benzimidazole-based inhibitors of Cryptosporidium parvum IMPDH. Bioorg Med Chem Lett 22:1985-8 (2012)  
Target
Name:
Inosine-5'-monophosphate dehydrogenase
Synonyms:
Cgd6_20 protein Inosine-5'-monophosphate dehydrogenase, probable | Inosine-5-monophosphate dehydrogenase (IMPDH)
Type:
Protein
Mol. Mass.:
43076.80
Organism:
Cryptosporidium parvum
Description:
Q8T6T2
Residue:
400
  
Inhibitor
Name:
BDBM50365447
Synonyms:
CHEMBL1957257
Type:
Small organic molecule
Emp. Form.:
C20H14Cl2N4O
Mol. Mass.:
397.257
SMILES:
Clc1ccc(NC(=O)Cn2c(nc3ccccc23)-c2ccccn2)cc1Cl
: