Target
Cytochrome P450 11B1, mitochondrial
Ligand
BDBM45884
Substrate
Meas. Tech.
ChEMBL_809500 (CHEMBL2015355)
IC50
663±n/a nM
Citation
 Hille, UEZimmer, CHaupenthal, JHartmann, RW Optimization of the First Selective Steroid-11ß-hydroxylase (CYP11B1) Inhibitors for the Treatment of Cortisol Dependent Diseases. ACS Med Chem Lett 2:559-564 (2011)  
Target
Name:
Cytochrome P450 11B1, mitochondrial
Synonyms:
C11B1_HUMAN CYPXIB1 Cytochrome P450 11B1 Cytochrome P450 11B1, mitochondrial | S11BH
Type:
Enzyme
Mol. Mass.:
57591.44
Organism:
Homo sapiens (Human)
Description:
P15538
Residue:
503
  
Inhibitor
Name:
BDBM45884
Synonyms:
4-(1-imidazolylmethyl)pyridine MLS-0091917.0001 cid_14424120
Type:
Small organic molecule
Emp. Form.:
C9H9N3
Mol. Mass.:
159.1879
SMILES:
C(c1ccncc1)n1ccnc1
: